{"text_format":"1","workbook":"xlsx","n_sheets":8,"sheets":["PI View Summary","Budget Worksheet","Subcontracts","Tuition Only","PI View ","Look ups","Cost Share Worksheet","Budget Worksheet (2)"],"not_rendered":{"charts":0,"images":0,"macros":1,"external_links":1,"defined_names":32,"comments":3,"pivot_tables":0},"unopened":[],"bounds":{"document_bytes":16777216,"sheet_cells":100000,"rows_first":2000,"rows_last":500,"rows_between":2000,"halvings":0,"cell_chars":16384,"cell_head_chars":4096},"cells_cut":0,"cells_raw":0,"read":"whole","date_system":"1900"}

{"sheet":"PI View Summary","index":0,"n_rows":37,"n_cols":16,"rows_kept":37,"cut":false,"hidden":false,"merged":[[0,13,0,14],[6,13,6,14]]}
[null,"University of North Carolina at Charlotte",null,null,null,null,null,null,null,null,null,null,null,"Graduate Student Support",null,"Click button to show Cost Share Worksheet"]
[null,null,"PI",null,{"$f":"'Budget Worksheet'!D2","v":"PI - NAME"},null,null,null,null,null,null,null,null,"Total Number of Students:",{"$f":"SUMIF('Budget Worksheet'!$C26:$J35,\"Ph.D. Grad Student\",'Budget Worksheet'!K26:K35)+SUMIF('Budget Worksheet'!$C26:$J35,\"MS Grad Student\",'Budget Worksheet'!K26:K35)","v":0}]
[null,null,"Sponsor",null,{"$f":"'Budget Worksheet'!D3","v":0},{"$f":"IF('Budget Worksheet'!$K$2=\"Yes\",\"Modular or R15 Budget\",\"\")","v":""},null,null,null,null,null,null,null,"Total Stipend Amount:",{"$f":"SUMIF('Budget Worksheet'!$C26:$Q35,\"Ph.D. Grad Student\",'Budget Worksheet'!$Q30:$Q35)+SUMIF('Budget Worksheet'!$C26:$Q35,\"MS Grad Student\",'Budget Worksheet'!$Q30:$Q35)","v":0}]
[null,null,"Project Start Date:",null,{"$f":"'Budget Worksheet'!I6","v":"2025-07-01"},null,null,null,null,null,null,null,null,"Total Fringe Benefits & Health Ins.:",{"$f":"SUMIF('Budget Worksheet'!$K27:$Q35,'Budget Worksheet'!K31,'Budget Worksheet'!Q27:Q35)+SUMIF('Budget Worksheet'!$K27:$Q35,'Budget Worksheet'!K32,'Budget Worksheet'!Q27:Q35)","v":0},"Click button to hide Cost Share Worksheet"]
[null,null,"Project End Date:",null,{"$f":"'Budget Worksheet'!J6","v":"2026-06-30"},null,null,null,null,null,null,null,null,"Total Tuition:",{"$f":"SUM('Budget Worksheet'!Q78:Q80)","v":0}]
[null,null,null,null,null,null,null,null,null,null,null,null,null,"Total Amount:",{"$f":"SUM(O3:O5)","v":0}]
[null,null,"Sponsor\nYear 1","Cost Share\nYear 1","Sponsor\nYear 2","Cost Share\nYear 2","Sponsor\nYear 3","Cost Share\nYear 3","Sponsor\nYear 4","Cost Share\nYear 4","Sponsor\nYear 5","Cost Share\nYear 5","Total","Undergraduate Student Support"]
[null,"Salaries and Wages",null,null,null,null,null,null,null,null,null,null,null,"Total Number of Students:",{"$f":"SUMIF('Budget Worksheet'!$C38:$J45,\"Undergraduate Student\",'Budget Worksheet'!$K38:$K45)","v":0}]
[null,"Senior Personnel AY/CY Salary",{"$f":"SUMIF('Budget Worksheet'!$C12:C44,\"Academic Year Salary\",'Budget Worksheet'!L12:L44)+SUMIF('Budget Worksheet'!$C12:$C44,\"Calendar Year Salary\",'Budget Worksheet'!L12:L44)","v":0},{"$f":"SUMIF('Cost Share Worksheet'!$C12:$C44,\"Academic Year Salary\",'Cost Share Worksheet'!L12:L44)+SUMIF('Cost Share Worksheet'!$C12:$C44,\"Calendar Year Salary\",'Cost Share Worksheet'!L12:L44)","v":0},{"$f":"SUMIF('Budget Worksheet'!$C12:$C44,\"Academic Year Salary\",'Budget Worksheet'!M12:M44)+SUMIF('Budget Worksheet'!$C12:$C44,\"Calendar Year Salary\",'Budget Worksheet'!M12:M44)","v":0},{"$f":"SUMIF('Cost Share Worksheet'!$C12:$C44,\"Academic Year Salary\",'Cost Share Worksheet'!M12:M44)+SUMIF('Cost Share Worksheet'!$C12:$C44,\"Calendar Year Salary\",'Cost Share Worksheet'!M12:M44)","v":0},{"$f":"SUMIF('Budget Worksheet'!$C12:$C44,\"Academic Year Salary\",'Budget Worksheet'!N12:N44)+SUMIF('Budget Worksheet'!$C12:$C44,\"Calendar Year Salary\",'Budget Worksheet'!N12:N44)","v":0},{"$f":"SUMIF('Cost Share Worksheet'!$C12:$C44,\"Academic Year Salary\",'Cost Share Worksheet'!N12:N44)+SUMIF('Cost Share Worksheet'!$C12:$C44,\"Calendar Year Salary\",'Cost Share Worksheet'!N12:N44)","v":0},{"$f":"SUMIF('Budget Worksheet'!$C12:$C44,\"Academic Year Salary\",'Budget Worksheet'!O12:O44)+SUMIF('Budget Worksheet'!$C12:$C44,\"Calendar Year Salary\",'Budget Worksheet'!O12:O44)","v":0},{"$f":"SUMIF('Cost Share Worksheet'!$C12:$C44,\"Academic Year Salary\",'Cost Share Worksheet'!O12:O44)+SUMIF('Cost Share Worksheet'!$C12:$C44,\"Calendar Year Salary\",'Cost Share Worksheet'!O12:O44)","v":0},{"$f":"SUMIF('Budget Worksheet'!$C12:$C44,\"Academic Year Salary\",'Budget Worksheet'!$P12:$P44)+SUMIF('Budget Worksheet'!$C12:$C44,\"Calendar Year Salary\",'Budget Worksheet'!$P12:$P44)","v":0},{"$f":"SUMIF('Cost Share Worksheet'!$C12:$C44,\"Academic Year Salary\",'Cost Share Worksheet'!P12:P44)+SUMIF('Cost Share Worksheet'!$C12:$C44,\"Calendar Year Salary\",'Cost Share Worksheet'!P12:P44)","v":0},{"$f":"SUM(C9:L9)","v":0},"Total Stipend Amount:",{"$f":"SUMIF('Budget Worksheet'!$C38:$Q45,\"Undergraduate Student\",'Budget Worksheet'!$Q42:Q45)","v":0}]
[null,"Senior Personnel Summer Salary",{"$f":"SUMIF('Budget Worksheet'!$C12:$C44,\"Summer Salary\",'Budget Worksheet'!L12:L44)","v":0},{"$f":"SUMIF('Cost Share Worksheet'!$C12:$C44,\"Summer Salary\",'Cost Share Worksheet'!L12:L44)","v":0},{"$f":"SUMIF('Budget Worksheet'!$C12:$C44,\"Summer Salary\",'Budget Worksheet'!M12:M44)","v":0},{"$f":"SUMIF('Cost Share Worksheet'!$C12:$C44,\"Summer Salary\",'Cost Share Worksheet'!M12:M44)","v":0},{"$f":"SUMIF('Budget Worksheet'!$C12:$C44,\"Summer Salary\",'Budget Worksheet'!N12:N44)","v":0},{"$f":"SUMIF('Cost Share Worksheet'!$C12:$C44,\"Summer Salary\",'Cost Share Worksheet'!N12:N44)","v":0},{"$f":"SUMIF('Budget Worksheet'!$C12:$C44,\"Summer Salary\",'Budget Worksheet'!O12:O44)","v":0},{"$f":"SUMIF('Cost Share Worksheet'!$C12:$C44,\"Summer Salary\",'Cost Share Worksheet'!O12:O44)","v":0},{"$f":"SUMIF('Budget Worksheet'!$C12:$C44,\"Summer Salary\",'Budget Worksheet'!$P12:$P44)","v":0},{"$f":"SUMIF('Cost Share Worksheet'!$C12:$C44,\"Summer Salary\",'Cost Share Worksheet'!P12:P44)","v":0},{"$f":"SUM(C10:L10)","v":0},"Total Fringe Benefits & Health Ins.:",{"$f":"SUMIF('Budget Worksheet'!$K39:$Q45,'Budget Worksheet'!K43,'Budget Worksheet'!Q39:Q45)","v":0}]
{"$rows_left_out":28}
{"sheet":"Budget Worksheet","index":1,"n_rows":118,"n_cols":17,"rows_kept":118,"cut":false,"hidden":false,"merged":[[96,7,96,10],[2,16,4,16],[6,3,6,5],[2,10,4,10],[2,8,4,8],[2,9,4,9],[2,11,4,11],[2,14,4,14],[2,15,4,15],[2,12,4,12],[2,13,4,13],[24,3,24,4],[77,8,77,9],[93,5,93,7],[77,4,77,7],[36,5,36,9],[24,5,24,9],[13,9,13,10],[32,9,32,10],[0,4,0,7],[5,4,5,6],[3,3,3,7],[4,3,4,7],[9,5,9,9]]}
[null,null,"Budget Worksheet","IPF 2025-0000","*Enter/select budget information in blue cells only",null,null,null,null,"HHS/NIH Salary Cap?","NIH Modular/\nR15 Budget?","If Yes, select NIH Mechanism","For R15, R21, R34 (Only)","NIH Max Years =",{"$f":"IFERROR(VLOOKUP($L$2,'Look ups'!$B$38:$I$42,2,FALSE),0)","v":3},"NIH Max TDC =",{"$f":"IFERROR(VLOOKUP($L$2,'Look ups'!$B$38:$I$42,8,FALSE),0)","v":375000}]
[null,null,"Principal Investigator:","PI - NAME",null,null,null,null,null,"No","No","R15","Click Here",null,"Total Direct & ","Indirect Costs",{"$f":"SUM(L103:P103)","v":0}]
[null,null,"Sponsor:",null,null,null,null,null,"Project Start Date","Project End Date","Pre Escalate \nKey Personnel?","Esc Factor\nKey Personnel","Pre Escalate \nOther Personnel?","Esc Factor\nOther Personnel","Pre Escalate \nStudents?","Esc Factor\nStudents","Tuition & Fees\nEsc Factor"]
[null,null,"Program:"]
[null,null,"Pre Award Budget Administrator:"]
[null,null,"Sponsor F&A Allowed?","Yes","Sponsor F&A rate:",null,null,0.54,"2025-07-01","2026-06-30","Y",2.5000000000000001E-2,"Y",2.5000000000000001E-2,"N",0.03,0.03]
[]
["F & A?","Appointment Months","Categories","Base Salary",null,"Effort Mos \nYr 1","Effort Mos \nYr 2","Effort Mos \nYr 3","Effort Mos \nYr 4","Effort Mos \nYr 5","Fringe Factor","Year 1","Year 2","Year 3","Year 4","Year 5","Total"]
[null,null,"A. Salaries and Wages"]
[null,null,"  Senior Personnel:",null,null,"Annual Base Salary below"]
{"$rows_left_out":109}
{"sheet":"Subcontracts","index":2,"n_rows":41,"n_cols":19,"rows_kept":41,"cut":false,"hidden":false,"merged":[[37,0,38,0],[4,2,4,3],[4,4,4,5],[25,0,26,0],[27,0,28,0],[29,0,30,0],[31,0,32,0],[33,0,34,0],[19,0,20,0],[21,0,22,0],[23,0,24,0],[4,13,4,17],[4,6,4,7],[4,8,4,9],[4,10,4,11],[35,0,36,0]]}
[null,"Subcontract Worksheet"]
[]
[null,"Subcontract F&A Costs only on first ",25000]
[]
[null,null,"Year 1",null,"Year 2",null,"Year 3",null,"Year 4",null,"Year 5",null,null,"Annual Total Costs (Direct and Indirect/F&A)"]
[null,"Subcontractor","Direct Costs","F&A Costs","Direct Costs","F&A Costs","Direct Costs","F&A Costs","Direct Costs","F&A Costs","Direct Costs","F&A Costs",null,"Year 1","Year 2","Year 3","Year 4","Year 5","Total"]
[1,null,null,null,null,null,null,null,null,null,null,null,null,{"$f":"SUM(C7:D7)","v":0},{"$f":"SUM(E7:F7)","v":0},{"$f":"SUM(G7:H7)","v":0},{"$f":"SUM(I7:J7)","v":0},{"$f":"SUM(K7:L7)","v":0},{"$f":"SUM(N7:R7)","v":0}]
[2,null,null,null,null,null,null,null,null,null,null,null,null,{"$f":"SUM(C8:D8)","v":0},0,0,0,0,{"$f":"SUM(N8:R8)","v":0}]
[3,null,null,null,null,null,null,null,null,null,null,null,null,0,0,0,0,0,0]
[4,null,null,null,null,null,null,null,null,null,null,null,null,0,0,0,0,0,0]
{"$rows_left_out":32}
{"sheet":"Tuition Only","index":3,"n_rows":20,"n_cols":7,"rows_kept":20,"cut":false,"hidden":true,"merged":[]}
["In State Graduate Tuition Only","FALL/SPR","FALL/SPR","FALL/SPR","FALL/SPR","FALL/SPR","FALL/SPR"]
[null,"21/22","22/23","23/24","24/25","25/26","26/27"]
["One GA",{"$f":"2168.5*2","v":4337},{"$f":"B3*1.055","v":4576},4828,5094,5374,5670]
["Two GAs",{"$f":"B3*2","v":8674},9152,9656,10188,10748,11340]
["Three GAs",{"$f":"B3*3","v":13011},13728,14484,15282,16122,17010]
[]
["Out of State Graduate Tuition Only","FALL/SPR","FALL/SPR","FALL/SPR","FALL/SPR","FALL/SPR","FALL/SPR"]
[null,"21/22","22/23","23/24","24/25","25/26","26/27"]
["One GA",{"$f":"8885.5*2","v":17771},{"$f":"B9*1.055","v":18748},19779,20867,22015,23226]
["Two GAs",{"$f":"B9*2","v":35542},37496,39558,41734,44030,46452]
{"$rows_left_out":11}
{"sheet":"PI View ","index":4,"n_rows":90,"n_cols":25,"rows_kept":90,"cut":false,"hidden":true,"merged":[[4,0,4,1],[0,0,0,16],[2,13,2,15],[2,17,2,23],[4,13,5,15],[1,8,1,10],[2,8,2,10],[1,0,1,1],[2,0,2,1],[3,0,3,1]]}
["PROPOSAL / AWARD BUDGET",null,null,null,null,null,null,null,null,null,null,null,null,null,null,null,null," "]
["OFFICE OF RESEARCH",null,null,null,null,null,null,"Principal Investigator:",{"$f":"PROPER(IF('Budget Worksheet'!D2<>\"\",'Budget Worksheet'!D2,\"\"))","v":"Pi - Name"},null,null,null,null,1,2,3,null,4,5,6,7,8,9,10]
[null,null,null,null,null,null,null,"Sponsor:",{"$f":"#REF!","v":{"$error":"#REF!"}},null,null,null," ","COST SHARE",null,null,null,"Additional COST SHAREs"]
[null,null,null,null,null,null,null,"Start Date","End Date","Grant","Fund","Org","Program",{"$f":"#REF!","v":{"$error":"#REF!"}},{"$f":"#REF!","v":{"$error":"#REF!"}},{"$f":"#REF!","v":{"$error":"#REF!"}},"TOTAL",{"$f":"#REF!","v":{"$error":"#REF!"}},{"$f":"#REF!","v":{"$error":"#REF!"}},{"$f":"#REF!","v":{"$error":"#REF!"}},{"$f":"#REF!","v":{"$error":"#REF!"}},{"$f":"#REF!","v":{"$error":"#REF!"}},{"$f":"#REF!","v":{"$error":"#REF!"}},{"$f":"#REF!","v":{"$error":"#REF!"}}]
[null,null,null,null,null,null,null,{"$f":"IF('Budget Worksheet'!I6=\"\",\"\",'Budget Worksheet'!I6)","v":"2025-07-01"},{"$f":"IF('Budget Worksheet'!J6=\"\",\"\",'Budget Worksheet'!J6)","v":"2026-06-30"},{"$f":"'Budget Worksheet'!C111","v":0},{"$f":"'Budget Worksheet'!C112","v":0},{"$f":"'Budget Worksheet'!C113","v":0},{"$f":"'Budget Worksheet'!C114","v":0},"Cost Share Years Displayed"]
[]
[null,null,"Mos \nYr 1","Mos \nYr 2","Mos \nYr 3","Mos \nYr 4","Mos \nYr 5","Year 1","Year 2","Year 3","Year 4","Year 5","Total",null,{"$f":"COUNTIFS(#REF!,\"Yes\")","v":{"$error":"#REF!"}}]
["A. Salaries and Wages"]
["  Senior Personnel:"]
[{"$f":"'Budget Worksheet'!C11","v":"PI - NAME"}]
{"$rows_left_out":81}
{"sheet":"Look ups","index":5,"n_rows":56,"n_cols":13,"rows_kept":56,"cut":false,"hidden":false,"merged":[[43,1,43,3],[50,1,50,4]]}
["Grad Student Hours Calculator",null,null,null,null,null,null,null,null,null,null,null,"Other Direct Costs"]
[]
[null,null,"FY25","FY26","FY27","FY28","FY29",null,"Other Personnel","Type","Acct",null,"Cost Type"]
["Type","Description","Fringe Rate",null,null,null,null,null,"Select Position","-",null,null,"-"]
["FF","EHRA Faculty",0.36799999999999999,0.377,0.38600000000000001,0.39600000000000002,0.40600000000000003,null,"Post Doctoral Associate","PD",null,null,"Alterations and Renovations"]
["USS","US Summer",7.7499999999999999E-2,{"$f":"C6*$H$19","v":7.7499999999999999E-2},7.7499999999999999E-2,7.7499999999999999E-2,7.7499999999999999E-2,null,"SHRA Staff","SHRA",null,null,"Advertising and Public Relations"]
["US","US Fall Semester",1E-3,1E-3,1E-3,1E-3,1E-3,null,"EHRA Staff","EHRA",null,null,"Animals (use and care)"]
["US","US Spring Semester",1E-3,1E-3,1E-3,1E-3,1E-3,null,"Non-Reg/Temp Staff","TS",null,null,"Animal Resource Facilities/Vivarium"]
["PD","Post Doctoral Associate",0.19400000000000001,0.19400000000000001,0.19400000000000001,0.19500000000000001,0.19500000000000001,null,"Principal Investigator","FF",null,null,"Computer Automated Data Processing Services"]
["EHRA","EHRA Staff",0.36799999999999999,0.377,0.38600000000000001,0.39600000000000002,0.40600000000000003,null,"GS Summer","GSS",null,null,"Communications"]
{"$rows_left_out":47}
{"sheet":"Cost Share Worksheet","index":6,"n_rows":114,"n_cols":17,"rows_kept":114,"cut":false,"hidden":false,"merged":[[92,5,92,7],[5,4,5,6],[6,3,6,5],[24,5,24,9],[36,5,36,9],[77,4,77,7],[77,8,77,9],[9,5,9,9],[13,9,13,10],[32,9,32,10],[2,16,4,16],[0,4,0,7],[1,3,1,7],[2,3,2,7],[2,8,4,8],[2,9,4,9],[2,10,4,10],[3,3,3,7],[4,3,4,7],[2,11,4,11],[2,12,4,12],[2,13,4,13],[2,14,4,14],[2,15,4,15]]}
[null,null,"Cost Share Budget Worksheet","IPF 2025-0000","*Enter/select budget information in blue cells only"]
[null,null,"Principal Investigator:",{"$f":"'Budget Worksheet'!D2","v":"PI - NAME"},null,null,null,null,null,null,null,null,null,null,"Total Direct & ","Indirect Costs",{"$f":"SUM(L99:P99)","v":0}]
[null,null,"Sponsor:",{"$f":"'Budget Worksheet'!D3","v":0},null,null,null,null,"Project Start Date","Project End Date","Pre Escalate \nKey Personnel?","Esc Factor\nKey Personnel","Pre Escalate \nOther Personnel?","Esc Factor\nOther Personnel","Pre Escalate \nStudents?","Esc Factor\nStudents","Tuition & Fees\nEsc Factor"]
[null,null,"Program:",{"$f":"'Budget Worksheet'!D4","v":0}]
[null,null,"Pre Award Budget Administrator:",{"$f":"'Budget Worksheet'!D5","v":0}]
[null,null,"Sponsor F&A Allowed?","Yes","Sponsor F&A rate:",null,null,0.54,"2025-07-01","2026-06-30","N",0,"N",0,"N",0,0]
[]
["F & A?","Appointment Months","Categories","Base Salary",null,"Effort Mos \nYr 1","Effort Mos \nYr 2","Effort Mos \nYr 3","Effort Mos \nYr 4","Effort Mos \nYr 5","Fringe Factor","Year 1","Year 2","Year 3","Year 4","Year 5","Total"]
[null,null,"A. Salaries and Wages"]
[null,null,"  Senior Personnel:",null,null,"Annual Base Salary below"]
{"$rows_left_out":105}
{"sheet":"Budget Worksheet (2)","index":7,"n_rows":112,"n_cols":17,"rows_kept":112,"cut":false,"hidden":true,"merged":[[2,16,4,16],[0,4,0,7],[1,3,1,7],[2,3,2,7],[2,8,4,8],[2,9,4,9],[2,10,4,10],[3,3,3,7],[4,3,4,7],[2,11,4,11],[2,12,4,12],[2,13,4,13],[2,14,4,14],[2,15,4,15],[0,0,5,1],[5,4,5,6],[6,3,6,5],[23,5,23,9],[35,5,35,9],[23,3,23,4],[13,9,13,10],[31,9,31,10]]}
["**DO NOT DELETE. This sheet is used for Macros on the main budget worksheet",null,"Budget Worksheet","IPF 21-0000","*Enter/select budget information in blue cells only",null,null,null,"Salary Cap?",{"$f":"'Budget Worksheet'!J2","v":"No"},"NIH Modular Budget?",{"$f":"'Budget Worksheet'!K2","v":"No"}]
[null,null,"Principal Investigator:","PI - NAME",null,null,null,null,null,null,null,null,null,null,"Total Direct & ","Indirect Costs",{"$f":"SUM(L97:P97)","v":0}]
[null,null,"Sponsor:","NIH",null,null,null,null,"Project Start Date","Project End Date","Pre Escalate \nKey Personnel?","Esc Factor\nKey Personnel","Pre Escalate \nOther Personnel?","Esc Factor\nOther Personnel","Pre Escalate \nStudents?","Esc Factor\nStudents","Tuition & Fees\nEsc Factor"]
[null,null,"Program:"]
[null,null,"Pre Award Budget Administrator:"]
[null,null,"Sponsor F&A Allowed?","Yes","Sponsor F&A rate:",null,null,0.51,"2020-01-01","2022-12-31",{"$f":"'Budget Worksheet'!K6","v":"Y"},{"$f":"'Budget Worksheet'!L6","v":2.5000000000000001E-2},{"$f":"'Budget Worksheet'!M6","v":"Y"},{"$f":"'Budget Worksheet'!N6","v":2.5000000000000001E-2},{"$f":"'Budget Worksheet'!O6","v":"N"},{"$f":"'Budget Worksheet'!P6","v":0.03},{"$f":"'Budget Worksheet'!Q6","v":0.03}]
[]
["F & A?","Appointment Months","Categories","Base Salary",null,"Effort Mos \nYr 1","Effort Mos \nYr 2","Effort Mos \nYr 3","Effort Mos \nYr 4","Effort Mos \nYr 5","Fringe Factor","Year 1","Year 2","Year 3","Year 4","Year 5","Total"]
[null,null,"A. Salaries and Wages"]
[null,null,"  Senior Personnel:"]
{"$rows_left_out":102}